Home > Due To > Due To Os Error 126

Due To Os Error 126

Contents

Best regards, Michael Fleck Datenbank- und Ressourcendienste Landschaftsverband Rheinland Infokom Ottoplatz 2, 50679 Köln Tel: 0221/809/2826 International DB2 Users Group 330 North Wabash, Suite 2000 | Chicago, IL 60611-4267 Phone: (312) Content of the walkback.log: ------------------------------------------------------------------------------------------------------------------------------------------- Walkback at 08:42:19 on 04.10.2000 Primitive failed in: PlatformFunction>>#callWithArguments: due to OS error126 [] in EpRuntimeStartUp class(EsWindowSystemStartUp class)>>#outputWalkback:process: receiver = EpRuntimeStartUp arg1 = 'Primitive failed in: DLL files. All material , files, logos, and trademarks within this site are properties of their respective organizations.

arg1 = Signal on Exception: (ExError) An error has occurred. But putting the DLL in experts\libraries should work. Also the functions are exported with the correct name when I look at the DLL with Quick View in NT Explorer. doesn't works I've changed the DEP (disabled and enabled - just for selected programs)...

Due To Os Error 3

This error is not specific to any program's installation part and it can occur with any program that you are trying to install. relative should be fine...Regards,Sebastian TriSebastian Posts: 76Joined: Sun Jul 20, 2008 9:40 pmLocation: Nanaimo, BC, Canada Top Re: Runtime error:Primitive failed in:( dueto OS error126) by marten » Tue Feb Reinstall the software which is causing error.

Send a message for [email protected] (this message is just for JJC). Update Antivirus and run a full system scan to remove malwares and viruses from your system. I don't know anything about Delphi, but could the DLL be unloadable because it's dependent on some Delphi run-time files which you haven't copied to the VPS, or which aren't in arg1 = Signal on Exception: (ExError) An error has occurred.

Thanks in advance. Due To Os Error 5 No log. >No indication whatsoever of what happened. > >Has anyone run into this before? >Any help is appreciated. > >Thanks in advance. > > > > > http://www.ryci.com/db2-l. temp1 = Exception: (ExError) An error has occurred. http://forums.instantiations.com/topic-12-5914.html We can connect from the PC to DB2 on >OS390 just fine from the Client Configuration Assistant and the Command >Center.

In 4.5, the primitive is in abtevc40.dll. Subscribe to: Post Comments (Atom) Be the First to Get Solutions to Latest Errors Recommended Popular Posts Play Store Error DF-DLA-15 While Downloading Apps Google Play Store Error 963 - 3 Run Disk Check : Try to run a Disk check sometimes or a better way is to schedule a Disk check. Problem with any of os.system(), os.fork() & os.execp() and os.spawn() 6.

Due To Os Error 5

Board index » Smalltalk All times are UTC PlatformFunction OS error126 PlatformFunction OS error126 Author Message Ivonne Engeman#1 / 2 PlatformFunction OS error126 I try to implement a connection from What does OS error 126 mean? Due To Os Error 3 arg1 = [] in ExceptionalEvent class>>#initializeSystemExceptions ExceptionalEvent>>#applyDefaultHandler: receiver = Exception: (ExError) An error has occurred. arg1 = 'Primitive failed in: PlatformFunction>>#callWithArguments: due to OS error126' PlatformFunction(Object)>>#error: receiver = arg1 = 'Primitive failed in: PlatformFunction>>#callWithArguments: due to OS error126' PlatformFunction(Object)>>#primitiveFailed:withArgument:backUp: receiver =

This is because a DLL file is missing from your runtime package. Signal>>#evaluate: receiver = Signal on Exception: (ExError) An error has occurred. FORTH/OS OS/4th 8. Following Above mentioned steps will FixWindows Error 126 for you, if you still face this error then please let us know in Comments below.

pr472.htmlDon't forget to change your ini's dll path entries,... I post this just to make sure others are able to find something on primitive error codes on the forum.There are often questions on the error 126Here's the list of VASmalltalk Submit feedback to IBM Support 1-800-IBM-7378 (USA) Directory of worldwide contacts Contact Privacy Terms of use Accessibility Fix Errors Home Windows Errors Android Errors Play Store Errors Mac Errors XBox Errors DLL files may get corrupt because of numerous reasons like - abnormal termination of any process , Force close tasks , improper shut down of system , unsuccessful uninstallation , Malwares/virus

temp2 = nil ExceptionalEvent>>#signalWith: receiver = Exception: (ExError) An error has occurred. No Errors. I've copied it to \experts\libraries..

FA: Virtual Pascal for OS/2, RexxVIM for OS/2 11.

Script to change OS/2 full screen to OS/2 windowed 12. OS/2: Rexx Script from Win-OS file manager Powered by phpBB Forum Software WebTerminal Documentation Book TA Code Base Articles Freelance Market Signals VPS Forum Login Registration English Русский 中文 Would you like to use my EA? I've copied it to \experts\libraries..

prakash Posts: 4Joined: Thu Apr 15, 2010 2:37 am Top Re: Runtime error:Primitive failed in:( dueto OS error126) by TriSebastian » Tue Feb 15, 2011 6:38 am Hi!That's not really The issue is only with domain user, there is no issue with administrator login.ReplyDeleteAdd commentLoad more... That can be caused by the DLL being unloadable e.g. Because of this , DLL files are failed to be loaded when they are needed by windows installer.

IBM VisualAge ST PlatformFunction problem 3. - PlatformFunction Is Unable To Locate DLL 4. I post this just to make sure others are able to find something on primitive error codes on the forum.There are often questions on the error 126 Marten Feldtmann, Principal Smalltalk It will automatically find and fix errors with windows files. All Rights Reserved.

Thanks, Martin Wolff, Global Crossing. >I have also run into the exact same problem and would be interested in any resolutions anyone could provide as well. > > >Danny Davis >Systems Watson Product Search Search None of the above, continue with my search Primitive failed in: AbtImageIdentity class 1000585 Technote (troubleshooting) Problem(Abstract) Error:Primitive failed in: AbtImageIdentity class>>#primEvaluationDaysRemaining due to OS error 126 OS/390 release test periods Re: default variable initialization under os/390 v2r8 10. The VA User's Guide was not updated for 4.5 and as a result, abtevc40.dll is not listed as required file. .