Home > Drupal 7 > Drupal 7 Autocomplete Ajax Error

Drupal 7 Autocomplete Ajax Error

Contents

If it's set unrequired, the error does not appear. Log in or register to post comments Comment #56 nod_ CreditAttribution: nod_ commented February 22, 2012 at 3:12pm I understand your issue but that's the way it ended up and the This is because it's the standard way of handling AJAX error in Drupal. For instance, see user_autocomplete. check my blog

Log in or register to post comments Comment #78 urlaub CreditAttribution: urlaub commented April 20, 2012 at 4:18pm We have drupal commerce installed and this is currently my #1 issue. When doing exactly the same operations with a Taxonomy Term autocomplete field it works smoothly.Files: CommentFileSizeAuthor #13 entityreference_drupal_exit.patch225 bytesJaza FAILED: [[SimpleTest]]: [MySQL] Unable to apply patch entityreference_drupal_exit.patch. Log in or register to post comments Comment #11 j0rd CreditAttribution: j0rd commented September 21, 2011 at 2:20pm FileSize autocomplete-1232416-11.patch952 bytes FAILED: [[SimpleTest]]: [MySQL] Unable to apply patch autocomplete-1232416-11.patch. Skip to main content Skip to search Main Menu Download & Extend Community Documentation Support Jobs Marketplace About Return to Content Search form Search Log in Create account Drupal Drupal Association https://www.drupal.org/node/1396626

Drupal Autocomplete Error 500

HTTP Result Code: 500 Debugging information follows. Try searching for some other node and see if that helps. Log in or register to post comments Comment #106 slashrsm CreditAttribution: slashrsm commented July 23, 2012 at 12:31pm My plan was to revert issue status back to D8, postponed when test

I suspect that the "override destination" option was the culprit. I will update when I understand more. Log in or register to post comments Comment #3 chrisgross CreditAttribution: chrisgross commented May 18, 2011 at 2:12pm That was the first thing I did. Drupal 7 Autocomplete Search Path: https://www.example.com/entityreference/autocomplete/single/field_name/node/article/6066 StatusText: ResponseText: ReadyState: 4 I also get a similar error in the "Authored by" field on the node so this may not be related to references module: An AJAX

I noticed that the Field Permissions module pushed out a new beta (7.x-1.0-beta2). Drupal 7 Autocomplete Widget User clicks on "Submit" 4. The code from the module which i used to create the content type is as follows: 'spelersfiche', 'name' => https://www.drupal.org/node/1864828 I was unable to check back yesterday. #1 Yes, they do share cookies.

It seems to me that the first argument to apply() should be console, and that seems to stop the exception (but as I say I'm no JS expert). Drupal 7 Autocomplete Text Field Can two different firmware files have same md5 sum? I've cleared caches. I've done this in a few production sites where a third party script we had no control over would use window.alert in some occasions.

Drupal 7 Autocomplete Widget

A review and RTBC would be awesome, and thanks for everyone's work on this so far (especially j0rd!) :-) Log in or register to post comments Comment #18 j0rd CreditAttribution: j0rd https://www.drupal.org/node/2576483 See the log in the details link for more information. Drupal Autocomplete Error 500 Log in or register to post comments Comment #48 effulgentsia CreditAttribution: effulgentsia commented January 31, 2012 at 2:54am FileSize ajax-error-display.patch2.1 KB FAILED: [[SimpleTest]]: [MySQL] 33,345 pass(es), 2 fail(s), and 3 exception(es). Drupal 7 Autocomplete Not Working Log in or register to post comments Comment #10 anon CreditAttribution: anon commented May 28, 2011 at 12:48am Category: bug » support Status: Active » Closed (fixed) No, node_view is not

Log in or register to post comments Comment #8 chrisgross CreditAttribution: chrisgross commented May 27, 2011 at 12:17pm Could this sort of thing be related to server performance and not code? http://thewebparrots.com/drupal-7/drupal-7-ajax-http-error-500.php However, I haven't found which event this can be done with successfully. The autocomplete started to work and the error went away. I don't agree with this at all, or at least I'll take some convincing. Drupal 7 Autocomplete Multiple Values

current community chat Stack Overflow Meta Stack Overflow your communities Sign up or log in to customize your list. Log in or register to post comments Comment #66 nod_ CreditAttribution: nod_ commented March 14, 2012 at 4:35pm FileSize core-js-drupal-log-1232416-66.patch4.87 KB PASSED: [[SimpleTest]]: [MySQL] 35,638 pass(es). I found that LoginToboggan was interfering with the authentication of the AJAX call. news In my case, I had two nodes which contained to following code in them to redirect to an other page: This was the reason why my

My "bug" is triggered in an exposed filters view form where a lot of js comes in to reshape the layout to colmnize the checkboxes and make headings of the group Drupal Ajax Error 200 I deselected this options and autocomplete seemed to work. I'm using ent ref version 1.1 Log in or register to post comments Comment #13 Jaza CreditAttribution: Jaza commented November 13, 2014 at 1:20am Version: 7.x-1.0-beta3 » 7.x-1.x-dev Assigned: Unassigned »

Sounds like EntityMalformedException is having the same issue.

Comments Comment #1 chrisgross CreditAttribution: chrisgross commented May 18, 2011 at 2:02pm Actually, it just occurred to me that it works fine when I type in the first character, but if I got the feeling that the script recommended in #117 would kill all alerts, which is perhaps not always desired behaviour (there could be simple form validations etc that should still I really hate to hack core, however tiny the hack -- it messes up a nice core upgrade workflow. Drupal Ajax Error On File Upload Definitely, but I wasn't sure what to look for.

You can apply patches by using the "patch" command-line application or with git (see Documentation page at http://drupal.org/node/707484 ). Log in or register to post comments Comment #26 j0rd CreditAttribution: j0rd commented September 26, 2011 at 10:17am Version: 8.x-dev » 7.x-dev @kevinmanx In linux you do: cd /your/drupal/directory/public_html wget http://drupal.org/files/issues/autocomplete-1232416-17-7x.patch Log in or register to post comments Comment #18 dropert CreditAttribution: dropert commented November 14, 2012 at 2:31pm Project: Linkit - Enriched linking experience » Drupal core Version: 7.x-1.x-dev » 7.3 http://thewebparrots.com/drupal-7/drupal-7-panels-ajax-error.php Glad they're going away.

Here is an issue for a logger that uses error_level #1419648: javascript error reporting interface. The hosting providers URL does not cause the error. Log in or register to post comments Comment #122 nod_ CreditAttribution: nod_ commented November 9, 2012 at 1:32pm Status: Needs work » Postponed Ok guys, I get that it's a painful Debugging information follows.

No module or component should ever rely on this anyway. I set a conditional to check if view_mode is 'full' and I haven't seen the error since. I don't know that these notifications are useful in any way to the end user. See the log in the details link for more information.

Intended behavior is value submitted to be 90 days. But I dont have any other opinion on that..... :) Log in or register to post comments Comment #82 bjcooper CreditAttribution: bjcooper commented May 9, 2012 at 7:48pm subscribing Log in How to apply Alexey solution. It seems that what's happening is when I try to connect to any content using the Media and entityreference modules from the subdomain it's redirecting to the main domain.

Log in or register to post comments Comment #8 lsolesen CreditAttribution: lsolesen commented October 29, 2012 at 12:03pm Status: Active » Postponed (maintainer needs more info) Is this still an issue check_plain($title) .' '; } } drupal_json_output($matches); exit; Comments Comment #1 anrikun CreditAttribution: anrikun commented December 29, 2012 at 11:37pm Status: Active » Closed (cannot reproduce) I could not reproduce this bug.ckeditor_link_autocomplete() Log in or register to post comments Comment #7 Rebekaloz CreditAttribution: Rebekaloz commented October 1, 2012 at 6:11pm This happens when some contributed modules are enabled. Hunk #4 FAILED at 407. 4 out of 4 hunks FAILED -- saving rejects to file core/misc/drupal.js.rej patching file core/misc/progress.js Hunk #1 FAILED at 87. 1 out of 1 hunk FAILED

I fixed this with console.log as mentioned in #116, because the error doesn't occur on IE in my case. I've applied the patch. I also do not know where to put the following suggestions "Either add the URL to the "urlIsAjaxTrusted" JavaScript setting (see ajax_pre_render_element() for an example) or call ajax_set_verification_header() in the Ajax Log in or register to post comments Comment #21 geerlingguy CreditAttribution: geerlingguy commented September 23, 2011 at 4:55pm @rfay - that's all I can find.

Path: http://mysite.com/taxonomy/autocomplete/field_tag ResponseText: ReadyState: 4 Works fine in Firefox. Log in or register to post comments Comment #64 leewillis77 CreditAttribution: leewillis77 commented March 9, 2012 at 10:25am If someone is really doing some diagnosis on this I don't think asking