Home > Dpkg Error > Dpkg Error Processing /var/cache/apt/archives/coreutils

Dpkg Error Processing /var/cache/apt/archives/coreutils

Contents

Processing triggers for libc-bin (2.19-13) ... (Reading database ... 7407 files and directories currently installed.) Preparing to unpack .../gpgv_1.4.18-6_i386.deb ... share|improve this answer edited Jul 9 at 0:00 karel 22.4k95165 answered Jul 8 at 22:22 Francisco Oliveira 211 add a comment| up vote 1 down vote I encountered a similar problem Would you like to answer one of these unanswered questions instead? Unpacking linux-image-3.16.0-43-generic (3.16.0-43.58~14.04.1) ... weblink

Unpacking libacl1:i386 (2.2.52-2) over (2.2.51-8) ... Processing triggers for libc-bin (2.19-13) ... (Reading database ... 7439 files and directories currently installed.) Preparing to unpack .../libpam-runtime_1.1.8-3.1_all.deb ... Done wine1.6 is already the newest version. Starting Settings used to calculate pkgProblemResolver::Scores:: Important => 3 Required => 2 Standard => 1 Optional => -1 Extra => -2 Essentials => 100 InstalledAndNotObsolete => 1 Depends => 1 Recommends http://askubuntu.com/questions/148383/how-to-resolve-dpkg-error-processing-var-cache-apt-archives-python-apport-2-0

Dpkg Error 1

As you have seen, am at a loss with wine software. run-parts: executing /etc/kernel/postinst.d/apt-auto-removal 3.16.0-43-generic /boot/vmlinuz-3.16.0-43-generic run-parts: executing /etc/kernel/postinst.d/initramfs-tools 3.16.0-43-generic /boot/vmlinuz-3.16.0-43-generic update-initramfs: Generating /boot/initrd.img-3.16.0-43-generic run-parts: executing /etc/kernel/postinst.d/pm-utils 3.16.0-43-generic /boot/vmlinuz-3.16.0-43-generic run-parts: executing /etc/kernel/postinst.d/update-notifier 3.16.0-43-generic /boot/vmlinuz-3.16.0-43-generic run-parts: executing /etc/kernel/postinst.d/zz-update-grub 3.16.0-43-generic /boot/vmlinuz-3.16.0-43-generic Generating grub configuration Installing new version of config file /etc/init.d/umountnfs.sh ... Preparing to unpack .../cups-filters_1.0.52-0ubuntu1.5_amd64.deb ...

Unpacking replacement libglade2-0 ... User contributions on this site are licensed under the Creative Commons Attribution Share Alike 4.0 International License. Selecting previously unselected package libcap2-bin. (Reading database ... 6744 files and directories currently installed.) Preparing to unpack .../libcap2-bin_1%3a2.24-6_i386.deb ... Dpkg Error Processing Package Dependency Problems - Leaving Unconfigured dpkg: error processing python-problem-report (--configure): Package is in a very bad inconsistent state - you should reinstall it before attempting configuration.

Preparing to unpack .../linux-signed-image-generic-lts-utopic_3.16.0.43.34_amd64.deb ... Dpkg Error Processing Archive *.deb (--install) Processing triggers for libc-bin (2.19-13) ... Processing triggers for libc-bin (2.19-13) ... (Reading database ... 6775 files and directories currently installed.) Preparing to unpack .../sysvinit-utils_2.88dsf-58_i386.deb ... https://answers.launchpad.net/ubuntu/+source/apt/+question/268948 Setting up linux-image-extra-3.16.0-43-generic (3.16.0-43.58~14.04.1) ...

the errors are telling you what to do ,,,,,,,just a bit cryptically . Dpkg Error Processing Cannot Access Archive No Such File Or Directory Code: E: Could not get lock /var/cache/apt/archives/lock - open (11: Resource temporarily unavailable) E: Unable to lock directory /var/cache/apt/archives/ [email protected]:/usr/bin$ sudo apt-get autoremove /var/cache/apt/archives/lock The error message , with the 'E" Selection Path Priority Status ------------------------------------------------------------ 0 /usr/bin/python3.5 2 auto mode * 1 /usr/bin/python2.7 1 manual mode 2 /usr/bin/python3.5 2 manual mode Press to keep the current choice[*], or type selection cheers, Andreas 0m0.0s INFO: ------------------------------------------------------------------------------ 0m0.0s INFO: To quickly glance what went wrong, scroll down to the bottom of this logfile. 0m0.0s INFO: FAQ available at https://wiki.debian.org/piuparts/FAQ 0m0.0s INFO: The FAQ

Dpkg Error Processing Archive *.deb (--install)

Unpacking libpam0g:i386 (1.1.8-3.1) over (1.1.3-7.1) ... dpkg: error processing apport (--configure): dependency problems - leaving unconfigured Processing triggers for libc-bin ... Dpkg Error 1 Unpacking systemd-sysv (215-11) ... Dpkg Error Processing Package (--configure) Done Building dependency tree Reading state information...

apt-get needs root privileges for real execution. have a peek at these guys Unpacking cups-filters (1.0.52-0ubuntu1.5) over (1.0.52-0ubuntu1.4) ... Unpacking replacement libv4l-0 ... perl: warning: Please check that your locale settings: LANGUAGE = "en_US", LC_ALL = (unset), LC_TIME = "en_US.UTF-8", LC_MONETARY = "en_US.UTF-8", LC_ADDRESS = "en_US.UTF-8", LC_TELEPHONE = "en_US.UTF-8", LC_NAME = "en_US.UTF-8", LC_MEASUREMENT = Dpkg Error Processing Archive Trying To Overwrite

I am logged in as root when I do this. Selecting previously unselected package acl. (Reading database ... 6721 files and directories currently installed.) Preparing to unpack .../archives/acl_2.2.52-2_i386.deb ... Processing triggers for libc-bin (2.19-13) ... (Reading database ... 7405 files and directories currently installed.) Preparing to unpack .../zlib1g_1%3a1.2.8.dfsg-2+b1_i386.deb ... check over here Preparing to unpack .../linux-signed-generic-lts-utopic_3.16.0.43.34_amd64.deb ...

Be careful, luckily the commands you gave with the options you used made no sense, so no actions were actually performed. Dpkg Error Processing Package Teamviewer (--install) VINNY system76 Bonox8 i7 4core HT 8MB L3 2.9GHz 16GB RAM Nvidia GTX 860M 4GB RAM 1152 cuda cores Reply With Quote Oct 25th 2015,07:50 PM #7 Bumpalot View Profile Processing triggers for libc-bin (2.19-13) ...

Also, if you already have another symlink /usr/bin/python3 pointing to the latest python3 release, as it usually happens, you can make another step forward with ln -rs /usr/bin/python3 /usr/bin/python.

UbuntuCommunityAsk!DeveloperDesignDiscourseHardwareInsightsJujuShopMore ›AppsHelpForumLaunchpadMAASCanonical current community chat Ask Ubuntu Ask Ubuntu Meta your communities Sign up or log in to customize your list. Can I use half-lap joint for table breadboard? Installing new version of config file /etc/init.d/halt ... Subprocess Dpkg Deb Fsys Tarfile Returned Error Exit Status 2 I still would like to try to get it cleaned up, if at all possible.

For details and our forum data attribution, retention and privacy policy, see here Log in / Register Ubuntuapt package Overview Code Bugs Blueprints Translations Answers Xubuntu: Broken "Software & Updates" after Setting up diffutils (1:3.3-1+b1) ... (Reading database ... 6735 files and directories currently installed.) Preparing to unpack .../e2fslibs_1.42.12-1_i386.deb ... Found linux image: /boot/vmlinuz-3.16.0-43-generic Found initrd image: /boot/initrd.img-3.16.0-43-generic Found linux image: /boot/vmlinuz-3.16.0-41-generic Found initrd image: /boot/initrd.img-3.16.0-41-generic Found linux image: /boot/vmlinuz-3.16.0-30-generic Found initrd image: /boot/initrd.img-3.16.0-30-generic Found Windows Boot Manager on /dev/[email protected]/EFI/Microsoft/Boot/bootmgfw.efi done this content Unpacking lsb-base (4.1+Debian13+nmu1) over (4.1+Debian8+deb7u1) ...

Traceback (most recent call last): File "/usr/bin/pyclean", line 33, in from debpython.namespace import add_namespace_files ValueError: bad marshal data (unknown type code) dpkg: error processing /var/cache/apt/archives/oneconf_0.2.8.1_all.deb (--unpack): subprocess new pre-removal script Unpacking libblkid1:i386 (2.25.2-5) over (2.20.1-5.3) ... Unpacking libbz2-1.0:i386 (1.0.6-7+b2) over (1.0.6-4) ... I had originally added ftp.ca.debian.org as a repository, not knowing that was illegal, to be able to get updates, if possible, when some programs would have been installed from a local

Processing triggers for libc-bin (2.19-0ubuntu6.6) ... Processing triggers for libc-bin (2.19-13) ... (Reading database ... 7438 files and directories currently installed.) Preparing to unpack .../base-passwd_3.5.37_i386.deb ... Traceback (most recent call last): File "/usr/bin/pyclean", line 33, in from debpython.namespace import add_namespace_files ValueError: bad marshal data (unknown type code) dpkg: warning: subprocess old pre-removal script returned error exit Tried the first approach and that worked famouisly. –Elder Geek Dec 9 '15 at 14:30 1 This had no effect for me.

Installing new version of config file /etc/init.d/bootmisc.sh ... Setting up libgpg-error0:i386 (1.17-3) ... Setting up libv4l-0 (0.8.6-1ubuntu2) ... Setting up adduser (3.113+nmu3) ... (Reading database ... 6547 files and directories currently installed.) Preparing to unpack .../libtinfo5_5.9+20140913-1+b1_i386.deb ...

You have the right idea in removing the lock file /var/cache/apt/archives/lock, but it is a file, and not a package, so you would not use apt-get to remove it, you would Having an Issue With Posting ? Processing triggers for libc-bin ... (Reading database ... 6717 files and directories currently installed.) Preparing to replace bsdutils 1:2.20.1-5.3 (using .../bsdutils_1%3a2.25.2-5_i386.deb) ... Done Building dependency tree Reading state information...

Ubuntu is based on Debian but it isn't Debian and the packages don't mix at all. Processing triggers for libc-bin ... (Reading database ... 6644 files and directories currently installed.) Preparing to replace sensible-utils 0.0.7 (using .../sensible-utils_0.0.9_all.deb) ... Browse other questions tagged 12.04 updates update-manager or ask your own question. Setting up libdebconfclient0:i386 (0.192) ...

Setting up cups-filters (1.0.52-0ubuntu1.5) ... .