Home > Dpkg Error > Dpkg Error Processing Samba4 -configure

Dpkg Error Processing Samba4 -configure

passed Preparing to replace libsynosdk-armada370-bin 5.2-5565-s1 (using libsynosdk-armada370-bin_5.2-5565-s1_all.deb) ... das Verhalten nach einem neuen DSM Update mit neuer Releasenummer, ob sich dieses ebenfalls nicht installieren lässt. Ich fürchte, du hast durch eine frühere Aktion irgendwas durcheinander gebracht. dpkg: error processing flashupdate_5.2-5565-s2_all.deb (--install): verification on package flashupdate_5.2-5565-s2_all.deb failed! http://thewebparrots.com/dpkg-error/dpkg-error-processing-samba4-configure-ubuntu-12-04.php

Ein Werksreset ist auch nur ein Teil der Miete. Unpacking replacement libsynoshare-armada370-bin ... Setting up synopkg-armada370-bin (5.2-5565-s2) ... dpkg: warning: subprocess old pre-removal script returned error exit status 100 dpkg - trying script from the new package instead ... https://ubuntuforums.org/showthread.php?t=2223552

I think it's just good advice whether it's Windows or Linux. With a USB stick (via UNetbootin) it kinda works, but will hang in the middle of the process. For details and our forum data attribution, retention and privacy policy, see here FAQ Forum Quick Links Unanswered Posts New Posts View Forum Leaders FAQ Contact an Admin Forum Community Forum Done The following packages will be REMOVED samba 0 upgraded, 0 newly installed, 1 to remove and 63 not upgraded. 2 not fully installed or removed.

Von DJ Mike im Forum Sonstiges Antworten: 3 Letzter Beitrag: 06.09.2013, 08:26 Fehler beim Update auf version 728 Von Das Schnitzel im Forum Firmware 0728 - 0732 Antworten: 2 Letzter Beitrag: dpkg: error processing package linux-image-extra-3.13.0-32-generic (--remove): subprocess installed post-removal script returned error exit status 1 Removing linux-image-3.13.0-32-generic (3.13.0-32.57) ... Setting up webapi-externaldevices-armada370-bin (5.2-5565-s2) ... Can someone please explain the way this ability cost is written?

PowerPC (ppc_85xx) basierte Geräte - DS209+, DS408, DS508, RS408 Marvell basierte Geräte - DS110j, DS210j, DS410j, DS109, DS209, DS409, RS409 USB Station and iUSB Visual Station VS60 / VS80 / VS240HD Setting up libsynoshare-armada370-bin (5.2-5565-s2) ... DoneBuilding dependency treeReading state information... https://bugs.launchpad.net/bugs/1233570 Promoção por tempo LIMITADO!

Dann Daten gesichert, Zurückgesetzt wie vom Support Mensch gesagt bekommen -> durchgeführt -> Fehlgeschlagen. zu wenig Speicherplatz ? Brasileira Dicas Copiar e colar textos do Windows para máquina virtual Debian Instalação Nvidia Optimus no Debian Jessie Instalando o editor de texto Xed no Slackware Converter vídeo para MP4 via DistroUbuntu 14.04 Trusty Tahr Re: Samba4 install problem on 14.04 Originally Posted by asatbluesboy Thanks a lot for the quick response!

And bab1, for goodness sake I suggest you first format the the disk Really? check over here ther eis no downgrade. DistroUbuntu 14.04 Trusty Tahr Re: Samba4 install problem on 14.04 Originally Posted by asatbluesboy Mine was running fine on 13.10 until I updated it a few days ago. run-parts: executing /etc/kernel/postrm.d/initramfs-tools 3.13.0-32-generic /boot/vmlinuz-3.13.0-32-generic update-initramfs: Deleting /boot/initrd.img-3.13.0-32-generic run-parts: executing /etc/kernel/postrm.d/zz-update-grub 3.13.0-32-generic /boot/vmlinuz-3.13.0-32-generic /usr/sbin/grub-mkconfig: 11: /etc/default/grub: GRUB: not found run-parts: /etc/kernel/postrm.d/zz-update-grub exited with return code 127 Failed to process /etc/kernel/postrm.d at

https://bugs.launchpad.net/bugs/904013 Title: dpkg: error processing google-chrome-unstable:i386 (--install): To manage notifications about this bug go to: https://bugs.launchpad.net/ubuntu/+source/gconf/+bug/904013/+subscriptions -- ubuntu-bugs mailing list [email protected] https://lists.ubuntu.com/mailman/listinfo/ubuntu-bugs Next Message by Thread: [Bug 467875] Re: apt_check.py crashed check my blog Isn't this "Windows advice"? Invariants of higher genus curves What is the difference between SAN and SNI SSL certificates? more hot questions question feed about us tour help blog chat data legal privacy policy work here advertising info mobile contact us feedback Technology Life / Arts Culture / Recreation Science

dpkg: error while cleaning up: subprocess installed post-installation script returned error exit status 100 Selecting previously unselected package samba. Sorry, dein erster Screenshot ist kaum zu lesen. After this operation, 18,3 MB of additional disk space will be used. http://thewebparrots.com/dpkg-error/dpkg-error-processing-top-configure.php After this operation, 23.4 MB disk space will be freed.

Why aren't Muggles extinct? Why QEMU can't allocate the memory if the Linux caches are too big? Adv Reply May 15th, 2014 #7 mastablasta View Profile View Forum Posts Private Message Ubuntu Member Join Date Nov 2009 BeansHidden!

Done Building dependency tree Reading state information...

passed Preparing to replace isc-dhcp-4.x-armada370-bin 4.3.0-5565-s2 (using isc-dhcp-4.x-armada370-bin_4.3.0-5565-s2_all.deb) ... id sogo 1> /dev/null 2>&1; thengroupadd -f -r sogouseradd -d /var/lib/sogo -g sogo -c "SOGo daemon" -s /usr/sbin/nologin -r sogofi...The sogo user exists and the sogo group doesn't. run-parts: executing /etc/kernel/postrm.d/initramfs-tools 3.13.0-32-generic /boot/vmlinuz-3.13.0-32-generic update-initramfs: Deleting /boot/initrd.img-3.13.0-32-generic run-parts: executing /etc/kernel/postrm.d/zz-update-grub 3.13.0-32-generic /boot/vmlinuz-3.13.0-32-generic /usr/sbin/grub-mkconfig: 11: /etc/default/grub: GRUB: not found run-parts: /etc/kernel/postrm.d/zz-update-grub exited with return code 127 Failed to process /etc/kernel/postrm.d at What is the most befitting place to drop 'H'itler bomb to score decisive victory in 1945?

No ideas.RegardsDavor---Reading package lists... Unpacking replacement synoha-armada370-bin ... Unpacking replacement libsynowireless-armada370-bin ... have a peek at these guys dpkg: error processing webapi-SyslogClient-armada370-bin_5.2-5565-s2_all.deb (--install): verification on package webapi-SyslogClient-armada370-bin_5.2-5565-s2_all.deb failed!

Browse other questions tagged samba or ask your own question. If I try to do anything else - for instance, do an autoremove - I get Code: [email protected]:~$ sudo apt-get autoremove Reading package lists... Either way (downgrade or not) this action may be what is causing the install problems. Errors were encountered while processing: samba4 E: Sub-process /usr/bin/dpkg returned an error code (1) ProblemType: Package DistroRelease: Ubuntu 12.04 Package: samba4 4.0.0~alpha18.dfsg1-4ubuntu2 ProcVersionSignature: Ubuntu 3.8.0-30.44~precise1-generic 3.8.13.6 Uname: Linux 3.8.0-30-generic x86_64 ApportVersion:

debsig: Failed verification for webapi-SyslogClient-armada370-bin_5.2-5565-s2_all.deb. Authenticating flashupdate_5.2-5565-s2_all.deb ... Hast du mal ein Ticket bei Synology aufgemacht? I'm wondering whether I could downgrade until things are more stable.

http://ukdl.synology.com/download/cr...e/update_pack/ Oder bekommen Sie eine Meldung über ggf. DS415+ | DSM 6.0.2-8451U1 (Final) | 8GB RAM | 3 x WD 6TB WD60EFRX Red Raid5 DS212+ | DSM 6.0-7321U6 (Final) | 512MB RAM | 2 x WD 3TB WD30EZRX Green dpkg: error processing /var/cache/apt/archives/procps_1%3a3.2.8-11ubuntu6_amd64.deb (--unpack): subprocess new pre-removal script returned error exit status 100 invoke-rc.d: unknown initscript, /etc/init.d/procps not found. dpkg: error processing samba-4.x-armada370-bin_4.1.6-5565-s2_all.deb (--install): verification on package samba-4.x-armada370-bin_4.1.6-5565-s2_all.deb failed!

DoneBuilding dependency treeReading state information... With a USB stick (via UNetbootin) it kinda works, but will hang in the middle of the process. Authenticating smallupdate_5.2-5565-s2_all.deb ... Unpacking replacement webapi-externaldevices-armada370-bin ...

Ja es handelt sich um die 5565-0. Then try the install. For details and our forum data attribution, retention and privacy policy, see here Log in / Register Ubuntusamba4 package Overview Code Bugs Blueprints Translations Answers E: Sub-process /usr/bin/dpkg returned an error Done Building dependency tree Reading state information...

dpkg: warning: subprocess old pre-removal script returned error exit status 100 dpkg - trying script from the new package instead ... Still: Code: winbind : Depends: samba (= 2:4.1.6+dfsg-1ubuntu2.14.04.1) but it is not going to be installed strange naming since 14.04.1 is not out yet. debsig: Failed verification for smallupdate_5.2-5565-s2_all.deb. What is fungibility and why does it matters?